{"text_format":"1","workbook":"xlsx","n_sheets":3,"sheets":["User Input","Calculations","Lists"],"not_rendered":{"charts":1,"images":0,"macros":1,"external_links":1,"defined_names":0,"comments":0,"pivot_tables":0},"unopened":[],"bounds":{"document_bytes":16777216,"sheet_cells":100000,"rows_first":2000,"rows_last":500,"rows_between":2000,"halvings":0,"cell_chars":16384,"cell_head_chars":4096},"cells_cut":0,"cells_raw":0,"read":"whole","date_system":"1900"}

{"sheet":"User Input","index":0,"n_rows":13,"n_cols":5,"rows_kept":13,"cut":false,"hidden":false,"merged":[[0,2,0,11],[2,1,2,4],[9,1,9,5]]}
[null,null,"Western Cape Water Supply System - Dam Draw Down Estimator"]
[]
[null,"Water Usage"]
[null,"CCT Savings",0.45,{"$f":"AVERAGE(Calculations!O3:O54)","v":476.57126738385494},"Ml/d"]
[null,"Other Municipalities Savings",0.45,{"$f":"AVERAGE(Calculations!P3:P54)","v":52.952363042650582},"Ml/d"]
[null,"Agricultural Savings",0.6,{"$f":"AVERAGE(Calculations!Q3:Q54)","v":157.77673839501782},"Ml/d"]
[null,"Evaporation Losses","Normal",{"$f":"AVERAGE(Calculations!R3:R54)","v":141.79471856230879},"Ml/d"]
[]
[]
[null,"User Defined Augmentation Projects"]
[null,"Augmentation 1",null,"Ml/d","starting"]
[null,"Augmentation 2",null,"Ml/d","starting"]
[null,"Augmentation 3",null,"Ml/d","starting"]

{"sheet":"Calculations","index":1,"n_rows":54,"n_cols":25,"rows_kept":54,"cut":false,"hidden":false,"merged":[[0,2,1,2],[0,3,0,4],[0,21,1,21],[0,23,1,23],[0,24,1,24],[0,6,0,9],[0,10,0,13],[0,14,0,17],[0,18,1,18],[0,19,1,19],[0,20,1,20]]}
["Date:",null,"Week","Actual Storage",null,null,"Baseline Unrestricted Demand (Ml/d)",null,null,null,"User Change - Savings",null,null,null,"User Change - Demand (Ml/d)",null,null,null,"User -Augmentation (Ml/d)","Inflow (Ml/d)","Storage (MCM)","Storage (%)",null,"DSL (%)","Day Zero (%)"]
[{"$f":"TODAY()-1","v":"2018-01-23"},null,null,"MCM","%",null,"CCT","Other M","Agric","Evap","CCT","Other M","Agric","Evap","CCT","Other M","Agric","Evap"]
[null,null,"2017-11-05",339.59699999999998,0.37733,null,891.65518767114122,99.072798630126726,287.22222222222234,260.67844651643998,{"$f":"'User Input'!$C$4","v":0.45},{"$f":"'User Input'!$C$5","v":0.45},{"$f":"'User Input'!$C$6","v":0.6},{"$f":"IF('User Input'!$C$7=\"Normal\",1, IF('User Input'!$C$7=\"Low\",0.8,1.2))","v":1},{"$f":"(1-K3)*G3","v":490.41035321912773},{"$f":"(1-L3)*H3","v":54.490039246569701},114.88888888888894,{"$f":"N3*J3","v":260.67844651643998},{"$f":"IF(C3>='User Input'!$F$11,'User Input'!$C$11,0)+IF(C3>='User Input'!$F$12,'User Input'!$C$12,0)+IF(C3>='User Input'!$F$13,'User Input'!$C$13,0)","v":0},0,null,null,null,0.1,0.13500000000000001]
[null,null,{"$f":"C3+7","v":"2017-11-12"},330.86720399999996,0.36763022666666662,null,891.65518767114122,99.072798630126726,287.22222222222234,260.67844651643998,{"$f":"'User Input'!$C$4","v":0.45},{"$f":"'User Input'!$C$5","v":0.45},{"$f":"'User Input'!$C$6","v":0.6},{"$f":"IF('User Input'!$C$7=\"Normal\",1, IF('User Input'!$C$7=\"Low\",0.8,1.2))","v":1},{"$f":"(1-K4)*G4","v":490.41035321912773},54.490039246569701,114.88888888888894,{"$f":"N4*J4","v":260.67844651643998},{"$f":"IF(C4>='User Input'!$F$11,'User Input'!$C$11,0)+IF(C4>='User Input'!$F$12,'User Input'!$C$12,0)+IF(C4>='User Input'!$F$13,'User Input'!$C$13,0)","v":0},0,null,null,null,0.1,0.13500000000000001]
[null,null,{"$f":"C4+7","v":"2017-11-19"},325.27300000000002,0.36141444444444448,null,891.65518767114122,99.072798630126726,287.22222222222234,260.67844651643998,{"$f":"'User Input'!$C$4","v":0.45},{"$f":"'User Input'!$C$5","v":0.45},{"$f":"'User Input'!$C$6","v":0.6},{"$f":"IF('User Input'!$C$7=\"Normal\",1, IF('User Input'!$C$7=\"Low\",0.8,1.2))","v":1},490.41035321912773,54.490039246569701,114.88888888888894,260.67844651643998,{"$f":"IF(C5>='User Input'!$F$11,'User Input'!$C$11,0)+IF(C5>='User Input'!$F$12,'User Input'!$C$12,0)+IF(C5>='User Input'!$F$13,'User Input'!$C$13,0)","v":0},0,null,null,null,0.1,0.13500000000000001]
[null,null,"2017-11-26",324.5634,0.360626,null,891.65518767114122,99.072798630126726,287.22222222222234,260.67844651643998,{"$f":"'User Input'!$C$4","v":0.45},{"$f":"'User Input'!$C$5","v":0.45},{"$f":"'User Input'!$C$6","v":0.6},{"$f":"IF('User Input'!$C$7=\"Normal\",1, IF('User Input'!$C$7=\"Low\",0.8,1.2))","v":1},490.41035321912773,54.490039246569701,114.88888888888894,260.67844651643998,{"$f":"IF(C6>='User Input'!$F$11,'User Input'!$C$11,0)+IF(C6>='User Input'!$F$12,'User Input'!$C$12,0)+IF(C6>='User Input'!$F$13,'User Input'!$C$13,0)","v":0},0,null,null,null,0.1,0.13500000000000001]
[null,null,"2017-12-03",315.48007799999999,0.35053341999999998,null,932.28164863420818,103.58684984824538,769.35483870967698,285.72956260646345,{"$f":"'User Input'!$C$4","v":0.45},{"$f":"'User Input'!$C$5","v":0.45},{"$f":"'User Input'!$C$6","v":0.6},{"$f":"IF('User Input'!$C$7=\"Normal\",1, IF('User Input'!$C$7=\"Low\",0.8,1.2))","v":1},512.75490674881451,56.972767416534964,307.7419354838708,285.72956260646345,{"$f":"IF(C7>='User Input'!$F$11,'User Input'!$C$11,0)+IF(C7>='User Input'!$F$12,'User Input'!$C$12,0)+IF(C7>='User Input'!$F$13,'User Input'!$C$13,0)","v":0},0,null,null,null,0.1,0.13500000000000001]
[null,null,"2017-12-10",306.83,0.34092222222222218,null,932.28164863420818,103.58684984824538,769.35483870967698,285.72956260646345,{"$f":"'User Input'!$C$4","v":0.45},{"$f":"'User Input'!$C$5","v":0.45},{"$f":"'User Input'!$C$6","v":0.6},{"$f":"IF('User Input'!$C$7=\"Normal\",1, IF('User Input'!$C$7=\"Low\",0.8,1.2))","v":1},{"$f":"(1-K8)*G8","v":512.75490674881451},56.972767416534964,307.7419354838708,285.72956260646345,{"$f":"IF(C8>='User Input'!$F$11,'User Input'!$C$11,0)+IF(C8>='User Input'!$F$12,'User Input'!$C$12,0)+IF(C8>='User Input'!$F$13,'User Input'!$C$13,0)","v":0},0,null,null,null,0.1,0.13500000000000001]
[null,null,"2017-12-17",296.77843200000007,0.32975381333333342,null,932.28164863420818,103.58684984824538,769.35483870967698,285.72956260646345,{"$f":"'User Input'!$C$4","v":0.45},{"$f":"'User Input'!$C$5","v":0.45},{"$f":"'User Input'!$C$6","v":0.6},{"$f":"IF('User Input'!$C$7=\"Normal\",1, IF('User Input'!$C$7=\"Low\",0.8,1.2))","v":1},512.75490674881451,56.972767416534964,307.7419354838708,285.72956260646345,{"$f":"IF(C9>='User Input'!$F$11,'User Input'!$C$11,0)+IF(C9>='User Input'!$F$12,'User Input'!$C$12,0)+IF(C9>='User Input'!$F$13,'User Input'!$C$13,0)","v":0},0,null,null,null,0.1,0.13500000000000001]
[null,null,"2017-12-24",287.35118299999999,0.31927909222222223,null,932.28164863420818,103.58684984824538,769.35483870967698,285.72956260646345,{"$f":"'User Input'!$C$4","v":0.45},{"$f":"'User Input'!$C$5","v":0.45},{"$f":"'User Input'!$C$6","v":0.6},{"$f":"IF('User Input'!$C$7=\"Normal\",1, IF('User Input'!$C$7=\"Low\",0.8,1.2))","v":1},{"$f":"(1-K10)*G10","v":512.75490674881451},56.972767416534964,307.7419354838708,285.72956260646345,{"$f":"IF(C10>='User Input'!$F$11,'User Input'!$C$11,0)+IF(C10>='User Input'!$F$12,'User Input'!$C$12,0)+IF(C10>='User Input'!$F$13,'User Input'!$C$13,0)","v":0},0,null,null,null,0.1,0.13500000000000001]
[null,null,"2017-12-31",278.88379900000001,0.30987088777777777,null,932.28164863420818,103.58684984824538,769.35483870967698,285.72956260646345,{"$f":"'User Input'!$C$4","v":0.45},{"$f":"'User Input'!$C$5","v":0.45},{"$f":"'User Input'!$C$6","v":0.6},{"$f":"IF('User Input'!$C$7=\"Normal\",1, IF('User Input'!$C$7=\"Low\",0.8,1.2))","v":1},512.75490674881451,56.972767416534964,307.7419354838708,285.72956260646345,{"$f":"IF(C11>='User Input'!$F$11,'User Input'!$C$11,0)+IF(C11>='User Input'!$F$12,'User Input'!$C$12,0)+IF(C11>='User Input'!$F$13,'User Input'!$C$13,0)","v":0},0,null,null,null,0.1,0.13500000000000001]
[null,null,"2018-01-07",267.06299999999999,0.29673666666666665,null,932.28164863420818,103.58684984824538,1015.0537634408601,281.54960788102062,{"$f":"'User Input'!$C$4","v":0.45},{"$f":"'User Input'!$C$5","v":0.45},{"$f":"'User Input'!$C$6","v":0.6},{"$f":"IF('User Input'!$C$7=\"Normal\",1, IF('User Input'!$C$7=\"Low\",0.8,1.2))","v":1},512.75490674881451,56.972767416534964,406.02150537634407,281.54960788102062,{"$f":"IF(C12>='User Input'!$F$11,'User Input'!$C$11,0)+IF(C12>='User Input'!$F$12,'User Input'!$C$12,0)+IF(C12>='User Input'!$F$13,'User Input'!$C$13,0)","v":0},0,null,null,null,0.1,0.13500000000000001]
[null,null,"2018-01-14",257.71501499999999,0.28635001666666665,null,932.28164863420818,103.58684984824538,1015.0537634408601,281.54960788102062,{"$f":"'User Input'!$C$4","v":0.45},{"$f":"'User Input'!$C$5","v":0.45},{"$f":"'User Input'!$C$6","v":0.6},{"$f":"IF('User Input'!$C$7=\"Normal\",1, IF('User Input'!$C$7=\"Low\",0.8,1.2))","v":1},512.75490674881451,56.972767416534964,406.02150537634407,281.54960788102062,{"$f":"IF(C13>='User Input'!$F$11,'User Input'!$C$11,0)+IF(C13>='User Input'!$F$12,'User Input'!$C$12,0)+IF(C13>='User Input'!$F$13,'User Input'!$C$13,0)","v":0},0,null,null,null,0.1,0.13500000000000001]
[null,null,"2018-01-21",244.78874700000003,0.27198749666666672,null,932.28164863420818,103.58684984824538,1015.0537634408601,281.54960788102062,{"$f":"'User Input'!$C$4","v":0.45},{"$f":"'User Input'!$C$5","v":0.45},{"$f":"'User Input'!$C$6","v":0.6},{"$f":"IF('User Input'!$C$7=\"Normal\",1, IF('User Input'!$C$7=\"Low\",0.8,1.2))","v":1},512.75490674881451,56.972767416534964,406.02150537634407,281.54960788102062,{"$f":"IF(C14>='User Input'!$F$11,'User Input'!$C$11,0)+IF(C14>='User Input'!$F$12,'User Input'!$C$12,0)+IF(C14>='User Input'!$F$13,'User Input'!$C$13,0)","v":0},0,{"$f":"D14","v":244.78874700000003},{"$f":"U14/900","v":0.27198749666666672},null,0.1,0.13500000000000001]
[null,null,"2018-01-28",null,null,null,932.28164863420818,103.58684984824538,1015.0537634408601,281.54960788102062,{"$f":"'User Input'!$C$4","v":0.45},{"$f":"'User Input'!$C$5","v":0.45},{"$f":"'User Input'!$C$6","v":0.6},{"$f":"IF('User Input'!$C$7=\"Normal\",1, IF('User Input'!$C$7=\"Low\",0.8,1.2))","v":1},512.75490674881451,56.972767416534964,406.02150537634407,281.54960788102062,{"$f":"IF(C15>='User Input'!$F$11,'User Input'!$C$11,0)+IF(C15>='User Input'!$F$12,'User Input'!$C$12,0)+IF(C15>='User Input'!$F$13,'User Input'!$C$13,0)","v":0},0,{"$f":"U14+(S15+T15)*7/1000-(O15+P15+Q15+R15)*7/1000","v":235.98765548804104},0.26220850609782337,null,0.1,0.13500000000000001]
[null,null,"2018-02-04",null,null,null,985.70280671876048,109.52253407986223,1063.3597883597859,241.15416659168304,{"$f":"'User Input'!$C$4","v":0.45},{"$f":"'User Input'!$C$5","v":0.45},{"$f":"'User Input'!$C$6","v":0.6},{"$f":"IF('User Input'!$C$7=\"Normal\",1, IF('User Input'!$C$7=\"Low\",0.8,1.2))","v":1},542.13654369531832,60.23739374392423,425.34391534391438,241.15416659168304,{"$f":"IF(C16>='User Input'!$F$11,'User Input'!$C$11,0)+IF(C16>='User Input'!$F$12,'User Input'!$C$12,0)+IF(C16>='User Input'!$F$13,'User Input'!$C$13,0)","v":0},0,{"$f":"U15+(S16+T16)*7/1000-(O16+P16+Q16+R16)*7/1000","v":227.10555135241717},0.25233950150268575,null,0.1,0.13500000000000001]
[null,null,"2018-02-11",null,null,null,985.70280671876048,109.52253407986223,1063.3597883597859,241.15416659168304,{"$f":"'User Input'!$C$4","v":0.45},{"$f":"'User Input'!$C$5","v":0.45},{"$f":"'User Input'!$C$6","v":0.6},{"$f":"IF('User Input'!$C$7=\"Normal\",1, IF('User Input'!$C$7=\"Low\",0.8,1.2))","v":1},542.13654369531832,60.23739374392423,425.34391534391438,241.15416659168304,{"$f":"IF(C17>='User Input'!$F$11,'User Input'!$C$11,0)+IF(C17>='User Input'!$F$12,'User Input'!$C$12,0)+IF(C17>='User Input'!$F$13,'User Input'!$C$13,0)","v":0},0,218.22344721679329,0.2424704969075481,null,0.1,0.13500000000000001]
[null,null,"2018-02-18",null,null,null,985.70280671876048,109.52253407986223,1063.3597883597859,241.15416659168304,{"$f":"'User Input'!$C$4","v":0.45},{"$f":"'User Input'!$C$5","v":0.45},{"$f":"'User Input'!$C$6","v":0.6},{"$f":"IF('User Input'!$C$7=\"Normal\",1, IF('User Input'!$C$7=\"Low\",0.8,1.2))","v":1},542.13654369531832,60.23739374392423,425.34391534391438,241.15416659168304,{"$f":"IF(C18>='User Input'!$F$11,'User Input'!$C$11,0)+IF(C18>='User Input'!$F$12,'User Input'!$C$12,0)+IF(C18>='User Input'!$F$13,'User Input'!$C$13,0)","v":0},0,209.34134308116941,0.23260149231241045,null,0.1,0.13500000000000001]
[null,null,"2018-02-25",null,null,null,985.70280671876048,109.52253407986223,1063.3597883597859,241.15416659168304,{"$f":"'User Input'!$C$4","v":0.45},{"$f":"'User Input'!$C$5","v":0.45},{"$f":"'User Input'!$C$6","v":0.6},{"$f":"IF('User Input'!$C$7=\"Normal\",1, IF('User Input'!$C$7=\"Low\",0.8,1.2))","v":1},542.13654369531832,60.23739374392423,425.34391534391438,241.15416659168304,{"$f":"IF(C19>='User Input'!$F$11,'User Input'!$C$11,0)+IF(C19>='User Input'!$F$12,'User Input'!$C$12,0)+IF(C19>='User Input'!$F$13,'User Input'!$C$13,0)","v":0},0,200.45923894554554,0.22273248771727283,null,0.1,0.13500000000000001]
[null,null,"2018-03-04",null,null,null,904.58178888666259,100.5090876540736,878.55436081242499,168.67321776956172,{"$f":"'User Input'!$C$4","v":0.45},{"$f":"'User Input'!$C$5","v":0.45},{"$f":"'User Input'!$C$6","v":0.6},{"$f":"IF('User Input'!$C$7=\"Normal\",1, IF('User Input'!$C$7=\"Low\",0.8,1.2))","v":1},497.51998388766447,55.279998209740484,351.42174432497001,168.67321776956172,{"$f":"IF(C20>='User Input'!$F$11,'User Input'!$C$11,0)+IF(C20>='User Input'!$F$12,'User Input'!$C$12,0)+IF(C20>='User Input'!$F$13,'User Input'!$C$13,0)","v":0},0,192.94897433620199,0.21438774926244664,null,0.1,0.13500000000000001]
[null,null,"2018-03-11",null,null,null,904.58178888666259,100.5090876540736,878.55436081242499,168.67321776956172,{"$f":"'User Input'!$C$4","v":0.45},{"$f":"'User Input'!$C$5","v":0.45},{"$f":"'User Input'!$C$6","v":0.6},{"$f":"IF('User Input'!$C$7=\"Normal\",1, IF('User Input'!$C$7=\"Low\",0.8,1.2))","v":1},497.51998388766447,55.279998209740484,351.42174432497001,168.67321776956172,{"$f":"IF(C21>='User Input'!$F$11,'User Input'!$C$11,0)+IF(C21>='User Input'!$F$12,'User Input'!$C$12,0)+IF(C21>='User Input'!$F$13,'User Input'!$C$13,0)","v":0},0,185.43870972685843,0.20604301080762047,null,0.1,0.13500000000000001]
[null,null,"2018-03-18",null,null,null,904.58178888666259,100.5090876540736,878.55436081242499,168.67321776956172,{"$f":"'User Input'!$C$4","v":0.45},{"$f":"'User Input'!$C$5","v":0.45},{"$f":"'User Input'!$C$6","v":0.6},{"$f":"IF('User Input'!$C$7=\"Normal\",1, IF('User Input'!$C$7=\"Low\",0.8,1.2))","v":1},497.51998388766447,55.279998209740484,351.42174432497001,168.67321776956172,{"$f":"IF(C22>='User Input'!$F$11,'User Input'!$C$11,0)+IF(C22>='User Input'!$F$12,'User Input'!$C$12,0)+IF(C22>='User Input'!$F$13,'User Input'!$C$13,0)","v":0},0,177.92844511751488,0.1976982723527943,null,0.1,0.13500000000000001]
[null,null,"2018-03-25",null,null,null,904.58178888666259,100.5090876540736,878.55436081242499,168.67321776956172,{"$f":"'User Input'!$C$4","v":0.45},{"$f":"'User Input'!$C$5","v":0.45},{"$f":"'User Input'!$C$6","v":0.6},{"$f":"IF('User Input'!$C$7=\"Normal\",1, IF('User Input'!$C$7=\"Low\",0.8,1.2))","v":1},497.51998388766447,55.279998209740484,351.42174432497001,168.67321776956172,{"$f":"IF(C23>='User Input'!$F$11,'User Input'!$C$11,0)+IF(C23>='User Input'!$F$12,'User Input'!$C$12,0)+IF(C23>='User Input'!$F$13,'User Input'!$C$13,0)","v":0},4.7619047619047619,{"$f":"U22+(S23+T23)*7/1000-(O23+P23+Q23+R23)*7/1000","v":170.45151384150466},0.18939057093500519,null,0.1,0.13500000000000001]
[null,null,"2018-04-01",null,null,null,877.34359346824283,97.482621496471438,484.69135802469134,99.828728904701535,{"$f":"'User Input'!$C$4","v":0.45},{"$f":"'User Input'!$C$5","v":0.45},{"$f":"'User Input'!$C$6","v":0.6},{"$f":"IF('User Input'!$C$7=\"Normal\",1, IF('User Input'!$C$7=\"Low\",0.8,1.2))","v":1},482.5389764075336,53.615441823059292,193.87654320987656,99.828728904701535,{"$f":"IF(C24>='User Input'!$F$11,'User Input'!$C$11,0)+IF(C24>='User Input'!$F$12,'User Input'!$C$12,0)+IF(C24>='User Input'!$F$13,'User Input'!$C$13,0)","v":0},33.333333333333336,164.87582934242178,0.1831953659360242,null,0.1,0.13500000000000001]
[null,null,"2018-04-08",null,null,null,877.34359346824283,97.482621496471438,484.69135802469134,99.828728904701535,{"$f":"'User Input'!$C$4","v":0.45},{"$f":"'User Input'!$C$5","v":0.45},{"$f":"'User Input'!$C$6","v":0.6},{"$f":"IF('User Input'!$C$7=\"Normal\",1, IF('User Input'!$C$7=\"Low\",0.8,1.2))","v":1},482.5389764075336,53.615441823059292,193.87654320987656,99.828728904701535,{"$f":"IF(C25>='User Input'!$F$11,'User Input'!$C$11,0)+IF(C25>='User Input'!$F$12,'User Input'!$C$12,0)+IF(C25>='User Input'!$F$13,'User Input'!$C$13,0)","v":0},33.333333333333336,159.3001448433389,{"$f":"U25/900","v":0.17700016093704321},null,0.1,0.13500000000000001]
[null,null,"2018-04-15",null,null,null,877.34359346824283,97.482621496471438,484.69135802469134,99.828728904701535,{"$f":"'User Input'!$C$4","v":0.45},{"$f":"'User Input'!$C$5","v":0.45},{"$f":"'User Input'!$C$6","v":0.6},{"$f":"IF('User Input'!$C$7=\"Normal\",1, IF('User Input'!$C$7=\"Low\",0.8,1.2))","v":1},482.5389764075336,53.615441823059292,193.87654320987656,99.828728904701535,{"$f":"IF(C26>='User Input'!$F$11,'User Input'!$C$11,0)+IF(C26>='User Input'!$F$12,'User Input'!$C$12,0)+IF(C26>='User Input'!$F$13,'User Input'!$C$13,0)","v":0},33.333333333333336,153.72446034425602,{"$f":"U26/900","v":0.17080495593806225},null,0.1,0.13500000000000001]
[null,null,"2018-04-22",null,null,null,877.34359346824283,97.482621496471438,484.69135802469134,99.828728904701535,{"$f":"'User Input'!$C$4","v":0.45},{"$f":"'User Input'!$C$5","v":0.45},{"$f":"'User Input'!$C$6","v":0.6},{"$f":"IF('User Input'!$C$7=\"Normal\",1, IF('User Input'!$C$7=\"Low\",0.8,1.2))","v":1},482.5389764075336,53.615441823059292,193.87654320987656,99.828728904701535,{"$f":"IF(C27>='User Input'!$F$11,'User Input'!$C$11,0)+IF(C27>='User Input'!$F$12,'User Input'!$C$12,0)+IF(C27>='User Input'!$F$13,'User Input'!$C$13,0)","v":0},33.333333333333336,148.14877584517313,0.16460975093908126,null,0.1,0.13500000000000001]
[null,null,"2018-04-29",null,null,null,877.34359346824283,97.482621496471438,484.69135802469134,99.828728904701535,{"$f":"'User Input'!$C$4","v":0.45},{"$f":"'User Input'!$C$5","v":0.45},{"$f":"'User Input'!$C$6","v":0.6},{"$f":"IF('User Input'!$C$7=\"Normal\",1, IF('User Input'!$C$7=\"Low\",0.8,1.2))","v":1},482.5389764075336,53.615441823059292,193.87654320987656,99.828728904701535,{"$f":"IF(C28>='User Input'!$F$11,'User Input'!$C$11,0)+IF(C28>='User Input'!$F$12,'User Input'!$C$12,0)+IF(C28>='User Input'!$F$13,'User Input'!$C$13,0)","v":0},198.31029185867897,143.72793005576767,0.15969770006196407,null,0.1,0.13500000000000001]
[null,null,"2018-05-06",null,null,null,821.48220964402583,91.275801071558362,54.599761051373946,48.837507742513871,{"$f":"'User Input'!$C$4","v":0.45},{"$f":"'User Input'!$C$5","v":0.45},{"$f":"'User Input'!$C$6","v":0.6},{"$f":"IF('User Input'!$C$7=\"Normal\",1, IF('User Input'!$C$7=\"Low\",0.8,1.2))","v":1},451.81521530421423,50.201690589357106,21.83990442054958,48.837507742513871,{"$f":"IF(C29>='User Input'!$F$11,'User Input'!$C$11,0)+IF(C29>='User Input'!$F$12,'User Input'!$C$12,0)+IF(C29>='User Input'!$F$13,'User Input'!$C$13,0)","v":0},225.80645161290323,141.29971499066156,0.15699968332295727,null,0.1,0.13500000000000001]
[null,null,"2018-05-13",null,null,null,821.48220964402583,91.275801071558362,54.599761051373946,48.837507742513871,{"$f":"'User Input'!$C$4","v":0.45},{"$f":"'User Input'!$C$5","v":0.45},{"$f":"'User Input'!$C$6","v":0.6},{"$f":"IF('User Input'!$C$7=\"Normal\",1, IF('User Input'!$C$7=\"Low\",0.8,1.2))","v":1},451.81521530421423,50.201690589357106,21.83990442054958,48.837507742513871,{"$f":"IF(C30>='User Input'!$F$11,'User Input'!$C$11,0)+IF(C30>='User Input'!$F$12,'User Input'!$C$12,0)+IF(C30>='User Input'!$F$13,'User Input'!$C$13,0)","v":0},225.80645161290323,138.87149992555544,0.1543016665839505,null,0.1,0.13500000000000001]
{"$rows_left_out":25}
{"sheet":"Lists","index":2,"n_rows":24,"n_cols":5,"rows_kept":24,"cut":false,"hidden":false,"merged":[]}
[0.2,0.25,"Low","2017-12-31","Yes"]
[0.25,0.3,"Normal",{"$f":"EOMONTH(D1,1)","v":"2018-01-31"},"No"]
[0.3,0.35,"High",{"$f":"EOMONTH(D2,1)","v":"2018-02-28"}]
[0.35,0.4,null,"2018-03-31"]
[0.4,0.45,null,"2018-04-30"]
[0.45,0.5,null,"2018-05-31"]
[0.5,0.55000000000000004,null,"2018-06-30"]
[null,0.6,null,"2018-07-31"]
[null,0.65,null,"2018-08-31"]
[null,0.7,null,"2018-09-30"]
[null,null,null,"2018-10-31"]
[null,null,null,"2018-11-30"]
[null,null,null,"2018-12-31"]
[null,null,null,"2019-01-31"]
[null,null,null,"2019-02-28"]
[null,null,null,"2019-03-31"]
[null,null,null,"2019-04-30"]
[null,null,null,"2019-05-31"]
[null,null,null,"2019-06-30"]
[null,null,null,"2019-07-31"]
[null,null,null,"2019-08-31"]
[null,null,null,"2019-09-30"]
[null,null,null,"2019-10-31"]
[null,null,null,"2019-11-30"]